{"text_format":"1","workbook":"xlsx","n_sheets":9,"sheets":["Intro","Step","Step 1","USDAData","Step 2","Step 3","Step 4","Reference","Sheet4"],"not_rendered":{"charts":0,"images":9,"macros":1,"external_links":0,"defined_names":43,"comments":0,"pivot_tables":0},"unopened":[],"bounds":{"document_bytes":16777216,"sheet_cells":100000,"rows_first":2000,"rows_last":500,"rows_between":2000,"halvings":0,"cell_chars":16384,"cell_head_chars":4096},"cells_cut":0,"cells_raw":0,"read":"whole","date_system":"1900"}

{"sheet":"Intro","index":0,"n_rows":39,"n_cols":8,"rows_kept":39,"cut":false,"hidden":false,"merged":[[5,0,5,9],[6,0,6,3],[6,6,6,9]]}
[]
[]
[]
[]
[]
["Product Pricing Tool for Retail Sales"]
["Version 1.0",null,null,null,null,null,"2024-08-01"]
[]
["Ty Wolaver",null,null,null,null,null,null,"Becky Bowling"]
["Extension Specialist",null,null,null,null,null,null,"Extension Specialist"]
["Office: (931) 993-2466",null,null,null,null,null,null,"Office: (865) 974-7016"]
["Email: tyw@utk.edu",null,null,null,null,null,null,"Email: rbowlin2@utk.edu"]
[]
[]
[]
[]
[]
[]
[]
[]
[]
[]
[]
[]
[]
[]
[]
[]
[]
[]
{"$rows_left_out":10}
{"sheet":"Step","index":1,"n_rows":0,"n_cols":0,"rows_kept":0,"cut":false,"hidden":true,"merged":[]}

{"sheet":"Step 1","index":2,"n_rows":3468,"n_cols":13,"rows_kept":3468,"cut":false,"hidden":false,"merged":[[3,6,3,10],[4,6,7,10],[9,6,10,10],[11,6,11,10],[15,6,15,10]]}
[]
[null,null,"Product","Price","Starting Price"]
[null,null,"NA",0,{"$f":"ROUNDUP(D3,0)","v":0},"Do Not remove this line"]
[null,1,"Bone-In Ribeye Roast",null,{"$f":"ROUNDUP(D4,0)","v":0},null,"Step 1 Instructions",null,null,null,null,null,"Intro"]
[null,2,"Bone-In Ribeye Steak",11.37,12,null,null,null,null,null,null,null,"Step 2"]
[null,3,"Bnls Ribeye Roast",9.94,10,null,null,null,null,null,null,null,"Step 3"]
[null,4,"Bnls Ribeye Steak",10.09,11,null,null,null,null,null,null,null,"Step 4"]
[null,5,"T-Bone Steak",8.6,9]
[null,6,"Porterhouse Steak",11.51,12]
[null,7,"Tenderloin",12.7,13]
[null,8,"Filet Mignon",21.78,22]
[null,9,"Loin, Bnls",12.99,13]
[null,10,"Bone-In Strip Steak",8.9600000000000009,9]
[null,11,"Bnls New York Strip Steak",10.58,11]
[null,12,"Beef Backribs",4.01,5]
[null,13,"Sirloin Roast",null,0,null,"lswbfrtl.pdf (usda.gov)"]
[null,14,"Sirloin Steak\nBnls Sirloin Roast",7.96,8]
[null,15,"Bnls Sirloin Steak",8.0399999999999991,9]
[null,16,"Sirloin Tip Roast",5.79,6]
[null,17,"Sirloin Tip Steak",6.23,7]
[null,18,"Bnls Top Sirloin Roast",5.14,6]
[null,19,"Bnls Top Sirloin Steak",8.2799999999999994,9]
[null,20,"Top Round Roast",5.91,6]
[null,21,"Top Round Steak",6.09,7]
[null,22,"Bottom Round Roast",5.96,6]
[null,23,"Bottom Round Steak",5.48,6]
[null,24,"Eye Of Round Roast",5.86,6]
[null,25,"Eye Of Round Steak",6.22,7]
[null,26,"Rump Roast",5.39,6]
[null,27,"Rump Steak",3.99,4]
{"$rows_left_out":3439}
{"sheet":"USDAData","index":3,"n_rows":50,"n_cols":2,"rows_kept":50,"cut":false,"hidden":true,"merged":[]}
["Column1","Column5"]
["Bone-In Ribeye Roast"]
["Bone-In Ribeye Steak",11.37]
["Bnls Ribeye Roast",9.94]
["Bnls Ribeye Steak",10.09]
["T-Bone Steak",8.6]
["Porterhouse Steak",11.51]
["Tenderloin",12.7]
["Filet Mignon",21.78]
["Loin, Bnls",12.99]
["Bone-In Strip Steak",8.9600000000000009]
["Bnls New York Strip Steak",10.58]
["Beef Backribs",4.01]
["Sirloin Roast"]
["Sirloin Steak\nBnls Sirloin Roast",7.96]
["Bnls Sirloin Steak",8.0399999999999991]
["Sirloin Tip Roast",5.79]
["Sirloin Tip Steak",6.23]
["Bnls Top Sirloin Roast",5.14]
["Bnls Top Sirloin Steak",8.2799999999999994]
["Top Round Roast",5.91]
["Top Round Steak",6.09]
["Bottom Round Roast",5.96]
["Bottom Round Steak",5.48]
["Eye Of Round Roast",5.86]
["Eye Of Round Steak",6.22]
["Rump Roast",5.39]
["Rump Steak",3.99]
["Chuck/Shldr/Arm Roast",6.26]
["Chuck/Shldr/Arm Steak",6.18]
{"$rows_left_out":21}
{"sheet":"Step 2","index":4,"n_rows":24,"n_cols":18,"rows_kept":24,"cut":false,"hidden":false,"merged":[[21,10,26,15],[3,10,3,15],[4,10,6,15],[8,10,12,15],[13,10,16,15],[18,10,20,15]]}
[]
[]
[null,null,"Product","Quantity Produced","Quantity Sold (expected)","Your Current Price"]
[null,1,"Ground Beef 80-89%",2000,1900,5,null,null,null,null,"Step 2 Instructions",null,null,null,null,null,null,"Intro"]
[null,2,"Bone-In Ribeye Steak",40,40,21,null,null,null,null,"A) Select your product from the dropdown box. For it to appear, it must be present in the \"Product\" column of the Reference Prices table in Step 1.",null,null,null,null,null,null,"Step 1"]
[null,3,"Bnls Ribeye Roast",150,150,9.5,null,null,null,null,null,null,null,null,null,null,null,"Step 3"]
[null,4,"Bnls Ribeye Steak",100,95,11,null,null,null,null,null,null,null,null,null,null,null,"Step 4"]
[null,5,"Eye Of Round Roast",75,70,10.5]
[null,6,"Sirloin Tip Steak",300,250,6,null,null,null,null,"B) In the Quantity Produced Column, enter the amount of product you are attempting to price. It should be in the same units of production from step one prices. (i.e. if you are pricing beef and it is priced by pound in Step 1, you should enter the quantity you produced in pounds here)"]
[null,7,"NA",0,0,0]
[null,8,"NA",0,0,0]
[null,9,"NA",0,0,0]
[null,10,"NA",0,0,0]
[null,11,"NA",0,0,0,null,null,null,null,"***In Step 3, you are going to enter in your costs of production. The quantities you enter here should only be what you produced during the time you accrued those costs. ***"]
[null,12,"NA",0,0,0]
[null,13,"NA",0,0,0]
[null,14,"NA",0,0,0]
[null,15,"NA",0,0,0]
[null,16,"NA",0,0,0,null,null,null,null,"C) In the Quantity Sold (expected) column, enter the quantity of each cut of beef you expect to sell. "]
[null,17,"NA",0,0,0]
[null,18,"NA",0,0,0]
[null,19,"NA",0,0,0,null,null,null,null,"D) Your Current Price is not a necessary step to completing the model, but if you have a price you sold your product for in the previous year or production cycle, entering it here will show you differences in revenue when you complete the pricing run. If you have no previous price, just put 0. "]
[null,20,"NA",0,0,0]
[null,"Model cannot currently handle more than 20 products. For questions contact Ty Wolaver (tyw@utk.edu)"]

{"sheet":"Step 3","index":5,"n_rows":50,"n_cols":18,"rows_kept":50,"cut":false,"hidden":false,"merged":[[17,9,17,15],[18,9,21,15],[35,9,39,15],[23,9,27,15],[29,9,29,15],[30,9,33,15],[1,1,1,4],[6,9,7,15],[8,9,9,15],[6,6,6,7],[7,6,10,7],[11,6,12,7],[17,6,17,7],[18,6,22,7],[2,9,2,15],[4,9,5,15],[11,9,14,15],[15,9,15,15]]}
[]
[null,"Costs"]
[null,"Input","Cost per Unit","Number Used","Total Cost",null,"Total Cost",{"$f":"SUM(E4:E1048576)","v":33763.379999999997},null,"Step 3 Instructions"]
[null,"Labor",15,{"$f":"50.79*26","v":1320.54},{"$f":"D4*C4","v":19808.099999999999},null,"Profit Margin Desired",0.1,null,"A) Label all your costs by category into the Inputs Column",null,null,null,null,null,null,null,"Intro"]
[null,"Hay",56.82,139.5,{"$f":"D5*C5","v":7926.39},null,"Cost with Profit Margin",{"$f":"H3*(1+H4)","v":37139.718000000001},null,"B) List your cost per unit in the Cost Per Column (i.e. if labor is $15 an hour, enter $15 in the Cost per Unit for labor)",null,null,null,null,null,null,null,"Step 1"]
[null,"Mileage",0.625,98,{"$f":"D6*C6","v":61.25},null,null,null,null,null,null,null,null,null,null,null,null,"Step 2"]
[null,"Processing",1,{"$f":"1810.52+757.12","v":2567.64},{"$f":"D7*C7","v":2567.64},null,"Alternative 1 to Step 3 Instructions",null,null,"C) Enter the quantity used of each input into the Number Used column (i.e. if you used 10 hours of labor, enter 10 in the Number Used column)",null,null,null,null,null,null,null,"Step 4"]
[null,"Calves",425,8,{"$f":"D8*C8","v":3400},null,"A) After finding your cost of production from your records, enter in the total cost into Total Cost Determined Elsewhere cell highlighted in blue. "]
[null,null,null,null,{"$f":"D9*C9","v":0},null,null,null,null,"D) Enter your desired profit margin into the Profit Margin Desired cell highlighted in green"]
[null,null,null,null,0]
[null,null,null,null,0]
[null,null,null,null,0,null,"B) Enter in your desired profit margin into Profit Margin Desired (green)",null,null,"This model is not designed to effectively keep up with costs. For that, a proper record keeping system is recommended. For help setting up a record keeping system, reach out to your local Extension Specialist - Farm Management. To find your local agent visit:"]
[null,null,null,null,0]
[null,null,null,null,0,null,"Total Cost of Production Override",0]
[null,null,null,null,0]
[null,null,null,null,0,null,"Cost with Profit Margin",{"$f":"IF(H14>0,(H14*(1+H4)),H3*(1+H4))","v":37139.718000000001},null,"https://farmmanagement.tennessee.edu/the-manage-program/"]
[null,null,null,null,0]
[null,null,null,null,0,null,"Alternative 2 to Step 3 Instructions",null,null,"WARNING"]
[null,null,null,null,0,null,"If you already know the dollar amount of revenue you would like to receive from the sale of your product, you can enter that value into Total Revenue Determined Elsewhere highlighted in (green)",null,null,"Once you have entered a value into the Total Cost Production Override cell, it will override the Total Cost cell that is a sum of all costs entered. To undo this function, set Total Cost of Production Override to 0. "]
[null,null,null,null,0]
[null,null,null,null,0]
[null,null,null,null,0]
[null,null,null,null,0]
[null,null,null,null,0,null,"Guaranteed Revenue Override",0,null,"Once you have entered a value into Guaranteed Revenue Override, it will override both the Total Cost cell and the Total Cost of Production Override cell and will not be affected by a Profit Margin entered. To undo this function, set the Guaranteed Revenue Override to 0."]
[null,null,null,null,0]
[null,null,null,null,0]
[null,null,null,null,0]
[null,null,null,null,0]
[null,null,null,null,0]
[null,null,null,null,0]
{"$rows_left_out":21}
{"sheet":"Step 4","index":6,"n_rows":156,"n_cols":23,"rows_kept":156,"cut":false,"hidden":false,"merged":[[98,1,98,21],[130,11,130,14],[131,11,131,14],[5,1,5,21],[28,1,28,21],[51,1,51,21],[76,1,76,21],[82,1,82,21],[153,7,153,8],[154,6,154,8],[147,11,147,14],[148,11,148,14],[104,1,104,21],[132,11,132,14],[133,11,134,14],[135,11,136,14],[137,11,140,14],[142,11,145,14]]}
[null,null,1,2,3,4,5,6,7,8,9,10,11,12,13,14,15,16,17,18,19,20]
[null,"Product",{"$f":"'Step 2'!$C$4","v":"Ground Beef 80-89%"},{"$f":"'Step 2'!$C$5","v":"Bone-In Ribeye Steak"},{"$f":"'Step 2'!$C$6","v":"Bnls Ribeye Roast"},{"$f":"'Step 2'!$C$7","v":"Bnls Ribeye Steak"},{"$f":"'Step 2'!$C$8","v":"Eye Of Round Roast"},{"$f":"'Step 2'!$C$9","v":"Sirloin Tip Steak"},{"$f":"'Step 2'!$C$10","v":"NA"},{"$f":"'Step 2'!$C$11","v":"NA"},{"$f":"'Step 2'!$C$12","v":"NA"},{"$f":"'Step 2'!$C$13","v":"NA"},{"$f":"'Step 2'!$C$14","v":"NA"},{"$f":"'Step 2'!$C$15","v":"NA"},{"$f":"'Step 2'!$C$16","v":"NA"},{"$f":"'Step 2'!$C$17","v":"NA"},{"$f":"'Step 2'!$C$18","v":"NA"},{"$f":"'Step 2'!$C$19","v":"NA"},{"$f":"'Step 2'!$C$20","v":"NA"},{"$f":"'Step 2'!$C$21","v":"NA"},{"$f":"'Step 2'!$C$22","v":"NA"},{"$f":"'Step 2'!$C$23","v":"NA"}]
[null,"Average National Price",{"$f":"VLOOKUP(C2,'Step 1'!$C$3:$D$1048576,2,FALSE)","v":4.53},{"$f":"VLOOKUP(D2,'Step 1'!$C$3:$D$1048576,2,FALSE)","v":11.37},{"$f":"VLOOKUP(E2,'Step 1'!$C$3:$D$1048576,2,FALSE)","v":9.94},{"$f":"VLOOKUP(F2,'Step 1'!$C$3:$D$1048576,2,FALSE)","v":10.09},{"$f":"VLOOKUP(G2,'Step 1'!$C$3:$D$1048576,2,FALSE)","v":5.86},{"$f":"VLOOKUP(H2,'Step 1'!$C$3:$D$1048576,2,FALSE)","v":6.23},{"$f":"VLOOKUP(I2,'Step 1'!$C$3:$D$1048576,2,FALSE)","v":0},{"$f":"VLOOKUP(J2,'Step 1'!$C$3:$D$1048576,2,FALSE)","v":0},{"$f":"VLOOKUP(K2,'Step 1'!$C$3:$D$1048576,2,FALSE)","v":0},{"$f":"VLOOKUP(L2,'Step 1'!$C$3:$D$1048576,2,FALSE)","v":0},{"$f":"VLOOKUP(M2,'Step 1'!$C$3:$D$1048576,2,FALSE)","v":0},{"$f":"VLOOKUP(N2,'Step 1'!$C$3:$D$1048576,2,FALSE)","v":0},{"$f":"VLOOKUP(O2,'Step 1'!$C$3:$D$1048576,2,FALSE)","v":0},{"$f":"VLOOKUP(P2,'Step 1'!$C$3:$D$1048576,2,FALSE)","v":0},{"$f":"VLOOKUP(Q2,'Step 1'!$C$3:$D$1048576,2,FALSE)","v":0},{"$f":"VLOOKUP(R2,'Step 1'!$C$3:$D$1048576,2,FALSE)","v":0},{"$f":"VLOOKUP(S2,'Step 1'!$C$3:$D$1048576,2,FALSE)","v":0},{"$f":"VLOOKUP(T2,'Step 1'!$C$3:$D$1048576,2,FALSE)","v":0},{"$f":"VLOOKUP(U2,'Step 1'!$C$3:$D$1048576,2,FALSE)","v":0},{"$f":"VLOOKUP(V2,'Step 1'!$C$3:$D$1048576,2,FALSE)","v":0}]
[null,"Your Price",5,12,14,13,6,7,0,0,0,0,0,0,0,0,0,0,0,0,0,0]
[]
[null,"USDA"]
[null,null,{"$f":"C2","v":"Ground Beef 80-89%"},"Bone-In Ribeye Steak","Bnls Ribeye Roast","Bnls Ribeye Steak","Eye Of Round Roast","Sirloin Tip Steak",{"$f":"I2","v":"NA"},"NA","NA","NA","NA","NA","NA","NA","NA","NA","NA","NA","NA","NA"]
[1,{"$f":"TRANSPOSE(C2:V2)","v":"Ground Beef 80-89%"},{"$f":"IF($C$3>0,$C$3/C3,0)","v":1},{"$f":"IF($C$3>0,$C$3/D3,0)","v":0.39841688654353569},0.45573440643863183,0.44895936570862244,{"$f":"IF($C$3>0,$C$3/G3,0)","v":0.773037542662116},{"$f":"IF($C$3>0,$C$3/H3,0)","v":0.7271268057784912},{"$f":"IF($C$3>0,$C$3/I3,0)","v":{"$error":"#DIV/0!"}},{"$error":"#DIV/0!"},{"$error":"#DIV/0!"},{"$error":"#DIV/0!"},{"$error":"#DIV/0!"},{"$error":"#DIV/0!"},{"$error":"#DIV/0!"},{"$error":"#DIV/0!"},{"$error":"#DIV/0!"},{"$error":"#DIV/0!"},{"$error":"#DIV/0!"},{"$error":"#DIV/0!"},{"$error":"#DIV/0!"},{"$error":"#DIV/0!"}]
[2,"Bone-In Ribeye Steak",{"$f":"IF($D$3>0,$D$3/C3,0)","v":2.5099337748344368},{"$f":"IF($D$3>0,$D$3/D3,0)","v":1},1.1438631790744467,1.1268582755203171,{"$f":"IF($D$3>0,$D$3/G3,0)","v":1.9402730375426618},{"$f":"IF($D$3>0,$D$3/H3,0)","v":1.8250401284109148},{"$error":"#DIV/0!"},{"$error":"#DIV/0!"},{"$error":"#DIV/0!"},{"$error":"#DIV/0!"},{"$error":"#DIV/0!"},{"$error":"#DIV/0!"},{"$error":"#DIV/0!"},{"$error":"#DIV/0!"},{"$error":"#DIV/0!"},{"$error":"#DIV/0!"},{"$error":"#DIV/0!"},{"$error":"#DIV/0!"},{"$error":"#DIV/0!"},{"$error":"#DIV/0!"}]
[3,"Bnls Ribeye Roast",{"$f":"IF($E$3>0,$E$3/C3,0)","v":2.1942604856512138},{"$f":"IF($E$3>0,$E$3/D3,0)","v":0.87423043095866315},1,0.98513379583746274,{"$f":"IF($E$3>0,$E$3/G3,0)","v":1.6962457337883958},{"$f":"IF($E$3>0,$E$3/H3,0)","v":1.595505617977528},{"$error":"#DIV/0!"},{"$error":"#DIV/0!"},{"$error":"#DIV/0!"},{"$error":"#DIV/0!"},{"$error":"#DIV/0!"},{"$error":"#DIV/0!"},{"$error":"#DIV/0!"},{"$error":"#DIV/0!"},{"$error":"#DIV/0!"},{"$error":"#DIV/0!"},{"$error":"#DIV/0!"},{"$error":"#DIV/0!"},{"$error":"#DIV/0!"},{"$error":"#DIV/0!"}]
[4,"Bnls Ribeye Steak",{"$f":"IF($F$3>0,$F$3/C3,0)","v":2.2273730684326711},{"$f":"IF($F$3>0,$F$3/D3,0)","v":0.88742304309586639},1.0150905432595574,1,{"$f":"IF($F$3>0,$F$3/G3,0)","v":1.7218430034129693},{"$f":"IF($F$3>0,$F$3/H3,0)","v":1.6195826645264846},{"$error":"#DIV/0!"},{"$error":"#DIV/0!"},{"$error":"#DIV/0!"},{"$error":"#DIV/0!"},{"$error":"#DIV/0!"},{"$error":"#DIV/0!"},{"$error":"#DIV/0!"},{"$error":"#DIV/0!"},{"$error":"#DIV/0!"},{"$error":"#DIV/0!"},{"$error":"#DIV/0!"},{"$error":"#DIV/0!"},{"$error":"#DIV/0!"},{"$error":"#DIV/0!"}]
[5,"Eye Of Round Roast",{"$f":"IF($G$3>0,$G$3/C3,0)","v":1.2935982339955849},{"$f":"IF($G$3>0,$G$3/D3,0)","v":0.51539138082673708},0.58953722334004033,0.58077304261645202,{"$f":"IF($G$3>0,$G$3/G3,0)","v":1},0.9406099518459069,{"$error":"#DIV/0!"},{"$error":"#DIV/0!"},{"$error":"#DIV/0!"},{"$error":"#DIV/0!"},{"$error":"#DIV/0!"},{"$error":"#DIV/0!"},{"$error":"#DIV/0!"},{"$error":"#DIV/0!"},{"$error":"#DIV/0!"},{"$error":"#DIV/0!"},{"$error":"#DIV/0!"},{"$error":"#DIV/0!"},{"$error":"#DIV/0!"},{"$error":"#DIV/0!"}]
[6,"Sirloin Tip Steak",{"$f":"IF($H$3>0,$H$3/C3,0)","v":1.3752759381898454},{"$f":"IF($H$3>0,$H$3/D3,0)","v":0.54793315743183824},0.62676056338028174,0.61744301288404368,{"$f":"IF($H$3>0,$H$3/G3,0)","v":1.0631399317406143},1,{"$error":"#DIV/0!"},{"$error":"#DIV/0!"},{"$error":"#DIV/0!"},{"$error":"#DIV/0!"},{"$error":"#DIV/0!"},{"$error":"#DIV/0!"},{"$error":"#DIV/0!"},{"$error":"#DIV/0!"},{"$error":"#DIV/0!"},{"$error":"#DIV/0!"},{"$error":"#DIV/0!"},{"$error":"#DIV/0!"},{"$error":"#DIV/0!"},{"$error":"#DIV/0!"}]
[7,"NA",{"$f":"IF($I$3>0,$I$3/C3,0)","v":0},{"$f":"IF($I$3>0,$I$3/D3,0)","v":0},0,0,{"$f":"IF($I$3>0,$I$3/G3,0)","v":0},0,0,0,0,0,0,0,0,0,0,0,0,0,0,0]
[8,"NA",{"$f":"IF($J$3>0,$J$3/C3,0)","v":0},{"$f":"IF($J$3>0,$J$3/D3,0)","v":0},0,0,{"$f":"IF($J$3>0,$J$3/G3,0)","v":0},0,0,0,0,0,0,0,0,0,0,0,0,0,0,0]
[9,"NA",{"$f":"IF($K$3>0,$K$3/C3,0)","v":0},{"$f":"IF($K$3>0,$K$3/D3,0)","v":0},0,0,{"$f":"IF($K$3>0,$K$3/G3,0)","v":0},0,0,0,0,0,0,0,0,0,0,0,0,0,0,0]
[10,"NA",{"$f":"IF($L$3>0,$L$3/C3,0)","v":0},{"$f":"IF($L$3>0,$L$3/D3,0)","v":0},0,0,{"$f":"IF($L$3>0,$L$3/G3,0)","v":0},0,0,0,0,0,0,0,0,0,0,0,0,0,0,0]
[11,"NA",{"$f":"IF($M$3>0,$M$3/C3,0)","v":0},{"$f":"IF($M$3>0,$M$3/D3,0)","v":0},0,0,{"$f":"IF($M$3>0,$M$3/G3,0)","v":0},0,0,0,0,0,0,0,0,0,0,0,0,0,0,0]
[12,"NA",{"$f":"IF($N$3>0,$N$3/C3,0)","v":0},{"$f":"IF($N$3>0,$N$3/D3,0)","v":0},0,0,{"$f":"IF($N$3>0,$N$3/G3,0)","v":0},0,0,0,0,0,0,0,0,0,0,0,0,0,0,0]
[13,"NA",{"$f":"IF($O$3>0,$O$3/C3,0)","v":0},{"$f":"IF($O$3>0,$O$3/D3,0)","v":0},0,0,{"$f":"IF($O$3>0,$O$3/G3,0)","v":0},0,0,0,0,0,0,0,0,0,0,0,0,0,0,0]
[14,"NA",{"$f":"IF($P$3>0,$P$3/C3,0)","v":0},{"$f":"IF($P$3>0,$P$3/D3,0)","v":0},0,0,{"$f":"IF($P$3>0,$P$3/G3,0)","v":0},0,0,0,0,0,0,0,0,0,0,0,0,0,0,0]
[15,"NA",{"$f":"IF($Q$3>0,$Q$3/C3,0)","v":0},{"$f":"IF($Q$3>0,$Q$3/D3,0)","v":0},0,0,{"$f":"IF($Q$3>0,$Q$3/G3,0)","v":0},0,0,0,0,0,0,0,0,0,0,0,0,0,0,0]
[16,"NA",{"$f":"IF($R$3>0,$R$3/C3,0)","v":0},{"$f":"IF($R$3>0,$R$3/D3,0)","v":0},0,0,{"$f":"IF($R$3>0,$R$3/G3,0)","v":0},0,0,0,0,0,0,0,0,0,0,0,0,0,0,0]
[17,"NA",{"$f":"IF($S$3>0,$S$3/C3,0)","v":0},{"$f":"IF($S$3>0,$S$3/D3,0)","v":0},0,0,0,0,0,0,0,0,0,0,0,0,0,0,0,0,0,0]
[18,"NA",{"$f":"IF($T$3>0,$T$3/C3,0)","v":0},{"$f":"IF($T$3>0,$T$3/D3,0)","v":0},0,0,0,0,0,0,0,0,0,0,0,0,0,0,0,0,0,0]
[19,"NA",{"$f":"IF($U$3>0,$U$3/C3,0)","v":0},{"$f":"IF($U$3>0,$U$3/D3,0)","v":0},0,0,0,0,0,0,0,0,0,0,0,0,0,0,0,0,0,0]
[20,"NA",{"$f":"IF($V$3>0,$V$3/C3,0)","v":0},{"$f":"IF($V$3>0,$V$3/D3,0)","v":0},0,0,0,0,0,0,0,0,0,0,0,0,0,0,0,0,0,0]
[]
[null,"FARM"]
[null,null,{"$f":"C7","v":"Ground Beef 80-89%"},{"$f":"D7","v":"Bone-In Ribeye Steak"},"Bnls Ribeye Roast","Bnls Ribeye Steak","Eye Of Round Roast","Sirloin Tip Steak","NA","NA","NA","NA","NA","NA","NA","NA","NA","NA","NA","NA","NA","NA"]
{"$rows_left_out":127}
{"sheet":"Reference","index":7,"n_rows":0,"n_cols":0,"rows_kept":0,"cut":false,"hidden":true,"merged":[]}

{"sheet":"Sheet4","index":8,"n_rows":69,"n_cols":19,"rows_kept":69,"cut":false,"hidden":true,"merged":[[41,18,42,18],[41,7,42,7],[41,8,42,8],[41,9,42,9],[41,10,42,10],[41,11,42,11],[41,12,42,12],[41,13,42,13],[41,14,42,14],[41,15,42,15],[41,16,42,16],[41,17,42,17],[6,14,9,14],[6,15,9,15],[6,16,9,16],[6,17,9,17],[6,18,9,18],[41,2,42,2],[41,3,42,3],[41,4,42,4],[41,5,42,5],[41,6,42,6],[6,13,9,13],[6,1,9,1],[6,2,9,2],[6,3,9,3],[6,4,9,4],[6,5,9,5],[6,6,9,6],[6,7,9,7],[6,8,9,8],[6,10,9,10],[6,11,9,11],[6,12,9,12]]}
[]
[]
[null,"Column1","Column2","Column3","Column4","Column5","Column6","Column7","Column8","Column9","Column10","Column11","Column12","Column13","Column14","Column15","Column16","Column17","Column18"]
[null,"[image]","National Retail Report - Beef","null","null","null","null","null","null","null","null","null","null","null","null","null","Fri. May 3, 2024","null","null"]
[null,"null","(prices in dollars per pound)","null","Advertised Prices for Beef at Major Retail Supermarket Outlets ending during the period of 05/03 thru 05/09","null","null","null","null","null","null","null","null","null","null","null","null","null","null"]
[null,"null","NATIONAL SUMMARY","null","null","null","null","null","null","This week in Beef Retail","null","null","null","null","null","null","null","null","null"]
[null,null,"THIS WEEK","null","LAST WEEK","null","LAST YEAR","null","null","This week in beef retail the Feature Rate decreased by 4.4 percent and the Special Rate decreased","null","null","null","null","null","null","null","null","null"]
[null,null,null,null,null,null,null,null,null,"by 2.3 percent. The Activity Index showed a 17.8 percent decrease. Cuts from the Rib showed the"]
[null,null,null,null,null,null,null,null,null,"only increase in ad space while cuts from the Chuck, Round, Loin, Brisket, and Groud Beef all showed"]
[null,null,null,null,null,null,null,null,null,"a decrease in ad space compared to last week."]
[null,"Outlets",29200,"null",29200,"null",29200,"null","null","null","null","null","null","null","null","null","null","null","null"]
[null,"Feature Rate (1/)",0.64900000000000002,"null",0.69299999999999995,"null",0.63700000000000001,"null","null","null","null","null","null","null","null","null","null","null","null"]
[null,"Special Rate (2/)","null",7.8E-2,0.10100000000000001,"null",0.16500000000000001,"null","null","null","null","null","null","null","null","null","null","null","null"]
[null,"Activity Index (3/)",65370,"null",79510,"null",76140,"null","null","null","null","null","null","null","null","null","null","null","null"]
[null,"null","Stores","Wtd Avg","Stores","Wtd Avg","Stores","Wtd Avg","null","null","null","null","null","null","null","null","null","null","null"]
[null,"Bone-In Ribeye Roast",120,10.63,"null","null",30,11.87,"null","null","null","null","null","null","null","null","null","null","null"]
[null,"Bone-In Ribeye Steak",900,8.7799999999999994,3050,10.85,4280,10.050000000000001,"null","null","null","null","null","null","null","null","null","null","null"]
[null,"Bnls Ribeye Roast",1040,9.6,600,12.25,250,10.89,"null","null","null","null","null","null","null","null","null","null","null"]
[null,"Bnls Ribeye Steak",3090,12,880,19.47,3280,11.79,"null","null","Acitivity Index: 2 Week Comparison","null","null","null","null","null","null","null","null"]
[null,"T-Bone Steak",3710,9.15,4170,8.89,3040,9.16,"null","null","null","null","null","null","null","null","null","null","null"]
[null,"Porterhouse Steak",3690,11.31,2360,11.01,690,10.67,"null","null","null","null","null","null","null","null","null","null","null"]
[null,"Tenderloin",80,11.72,340,14.55,90,14.88,"null","null","RIB_ACTIVITY","CHUCK_ACTIVITY","null","null","null","ROUND_ACTIVITY","null","null","null"]
[null,"Filet Mignon",30,10.91,10,12.99,110,10.71,"null","null","LOIN_ACTIVITY","BRISKET_ACTIVITY","null","null","null","null","null","null","null"]
[null,"Loin, Bnls",60,10.99,520,10.49,90,4.99,"null","null","null","null","null","null","null","null","null","null","null"]
[null,"Bone-In Strip Steak",960,9.52,1670,8.07,1850,7.17,"null","24K","null","null","null","null","null","null","null","null","null"]
[null,"Bnls New York Strip Steak",1980,12.16,3980,11.8,2770,10.050000000000001,"null","null","null","null","null","null","null","null","null","null","null"]
[null,"Beef Backribs","null","null",100,3.96,390,6.13,"null","null","null","null","null","null","null","null","null","null","null"]
[null,"Sirloin Roast",130,6.99,80,5.78,"null","null","null","20K","null","null","null","null","null","null","null","null","null"]
[null,"Sirloin Steak",410,8.57,40,5.49,350,11.89,"null","null","null","null","null","null","null","null","null","null","null"]
[null,"Bnls Sirloin Roast","null","null",50,8.25,340,4.58,"null","null","null","null","null","null","null","null","null","null","null"]
{"$rows_left_out":39}